{"text_format":"1","workbook":"xlsx","n_sheets":2,"sheets":["Hesaplama","Sayfa2"],"not_rendered":{"charts":0,"images":753,"macros":1,"external_links":0,"defined_names":0,"comments":0,"pivot_tables":0},"unopened":[],"bounds":{"document_bytes":16777216,"sheet_cells":100000,"rows_first":2000,"rows_last":500,"rows_between":2000,"halvings":0,"cell_chars":16384,"cell_head_chars":4096},"cells_cut":0,"cells_raw":0,"read":"whole","date_system":"1900"}

{"sheet":"Hesaplama","index":0,"n_rows":256,"n_cols":16,"rows_kept":256,"cut":false,"hidden":false,"merged":[[0,0,0,7],[1,1,2,3],[1,4,3,4],[2,5,3,5],[2,6,3,6],[2,7,3,7],[3,1,4,1],[3,2,4,2],[3,3,4,3],[4,4,5,4],[4,5,5,5],[4,6,5,6],[4,7,5,7],[1,0,5,0]]}
["Bu Proğram bilgilendirme amaçlı yapılmış olup; lütfen kesin analiz ücretleri için Müdürlüğümüz ile irtibata geçiniz. Tel: 0 322 344 03 45 Dahili: 106"]
["                Sıra No","Talep Edilen Analiz",null,null,"ADANA T.S.T.M.","Numune Sayısı","Toplam P. Miktarı (kg)","Toplam Analiz Ücreti"]
[null,null,null,null,null,{"$f":"COUNTIF(P7:P256,\"x\")","v":0},{"$f":"SUMIFS(F7:F256,P7:P256,\"X\")","v":0},{"$f":"SUM(G7:G256)","v":0}]
[null,"Sertifika","Analiz Raporu","A. Sonuç Formu",null,null,null,null,null,null,{"$f":"SUMIFS(F7:F256,P7:P256,\"X\")","v":0}]
[null,null,null,null,"Tür","Parti Miktarı (kg)","Analiz Ücreti (TL.)","Düşünceler"]
[null,null,null,null,null,null,null,null,"Sertifika","Analiz Raporu","Analiz Sonuç Formu","Sertifika","Analiz Raporu","Analiz Sonuç Formu","Analiz Ücreti (TL.)"]
[1,null,null,null,null,null,{"$f":"O7","v":""},{"$f":"IF(OR(AND(I7=\"DOĞRU\",J7=\"DOĞRU\",K7=\"DOĞRU\"),AND(I7=\"DOĞRU\",J7=\"DOĞRU\"),AND(I7=\"DOĞRU\",K7=\"DOĞRU\"),AND(J7=\"DOĞRU\",K7=\"DOĞRU\")),\"Lütfen Bir Adet Analiz İşaretleyiniz.\",\"\")","v":""},"YANLIŞ","YANLIŞ","YANLIŞ",{"$f":"IF(OR(J7=\"DOĞRU\",K7=\"DOĞRU\"),\"\",I7)","v":"YANLIŞ"},{"$f":"IF(OR(I7=\"DOĞRU\",K7=\"DOĞRU\"),\"\",J7)","v":"YANLIŞ"},{"$f":"IF(OR(I7=\"DOĞRU\",J7=\"DOĞRU\"),\"\",K7)","v":"YANLIŞ"},{"$f":"IF(E7=\"\",\"\",IF(OR(AND(L7=\"DOĞRU\",F7>0),AND(M7=\"DOĞRU\",F7>0)),IF((F7/100)*VLOOKUP(E7,Sayfa2!$A$1:$B$72,2,1)>160,(F7/100)*VLOOKUP(E7,Sayfa2!$A$1:$B$72,2,1),160),IF(N7=\"DOĞRU\",160,\"\")))","v":""},{"$f":"IF(O7=\"\",\"\",\"x\")","v":""}]
[2,null,null,null,null,null,"",{"$f":"IF(OR(AND(I8=\"DOĞRU\",J8=\"DOĞRU\",K8=\"DOĞRU\"),AND(I8=\"DOĞRU\",J8=\"DOĞRU\"),AND(I8=\"DOĞRU\",K8=\"DOĞRU\"),AND(J8=\"DOĞRU\",K8=\"DOĞRU\")),\"Lütfen Bir Adet Analiz İşaretleyiniz.\",\"\")","v":""},"YANLIŞ","YANLIŞ","YANLIŞ",{"$f":"IF(OR(J8=\"DOĞRU\",K8=\"DOĞRU\"),\"\",I8)","v":"YANLIŞ"},{"$f":"IF(OR(I8=\"DOĞRU\",K8=\"DOĞRU\"),\"\",J8)","v":"YANLIŞ"},{"$f":"IF(OR(I8=\"DOĞRU\",J8=\"DOĞRU\"),\"\",K8)","v":"YANLIŞ"},{"$f":"IF(E8=\"\",\"\",IF(OR(AND(L8=\"DOĞRU\",F8>0),AND(M8=\"DOĞRU\",F8>0)),IF((F8/100)*VLOOKUP(E8,Sayfa2!$A$1:$B$72,2,1)>160,(F8/100)*VLOOKUP(E8,Sayfa2!$A$1:$B$72,2,1),160),IF(N8=\"DOĞRU\",160,\"\")))","v":""},{"$f":"IF(O8=\"\",\"\",\"x\")","v":""}]
[3,null,null,null,null,null,"","","YANLIŞ","YANLIŞ","YANLIŞ","YANLIŞ","YANLIŞ","YANLIŞ",{"$f":"IF(E9=\"\",\"\",IF(OR(AND(L9=\"DOĞRU\",F9>0),AND(M9=\"DOĞRU\",F9>0)),IF((F9/100)*VLOOKUP(E9,Sayfa2!$A$1:$B$72,2,1)>160,(F9/100)*VLOOKUP(E9,Sayfa2!$A$1:$B$72,2,1),160),IF(N9=\"DOĞRU\",160,\"\")))","v":""},""]
[4,null,null,null,null,null,"","","YANLIŞ","YANLIŞ","YANLIŞ","YANLIŞ","YANLIŞ","YANLIŞ",{"$f":"IF(E10=\"\",\"\",IF(OR(AND(L10=\"DOĞRU\",F10>0),AND(M10=\"DOĞRU\",F10>0)),IF((F10/100)*VLOOKUP(E10,Sayfa2!$A$1:$B$72,2,1)>160,(F10/100)*VLOOKUP(E10,Sayfa2!$A$1:$B$72,2,1),160),IF(N10=\"DOĞRU\",160,\"\")))","v":""},""]
[5,null,null,null,null,null,"","","YANLIŞ","YANLIŞ","YANLIŞ","YANLIŞ","YANLIŞ","YANLIŞ",{"$f":"IF(E11=\"\",\"\",IF(OR(AND(L11=\"DOĞRU\",F11>0),AND(M11=\"DOĞRU\",F11>0)),IF((F11/100)*VLOOKUP(E11,Sayfa2!$A$1:$B$72,2,1)>160,(F11/100)*VLOOKUP(E11,Sayfa2!$A$1:$B$72,2,1),160),IF(N11=\"DOĞRU\",160,\"\")))","v":""},""]
[6,null,null,null,null,null,"","","YANLIŞ","YANLIŞ","YANLIŞ","YANLIŞ","YANLIŞ","YANLIŞ",{"$f":"IF(E12=\"\",\"\",IF(OR(AND(L12=\"DOĞRU\",F12>0),AND(M12=\"DOĞRU\",F12>0)),IF((F12/100)*VLOOKUP(E12,Sayfa2!$A$1:$B$72,2,1)>160,(F12/100)*VLOOKUP(E12,Sayfa2!$A$1:$B$72,2,1),160),IF(N12=\"DOĞRU\",160,\"\")))","v":""},""]
[7,null,null,null,null,null,"","","YANLIŞ","YANLIŞ","YANLIŞ","YANLIŞ","YANLIŞ","YANLIŞ",{"$f":"IF(E13=\"\",\"\",IF(OR(AND(L13=\"DOĞRU\",F13>0),AND(M13=\"DOĞRU\",F13>0)),IF((F13/100)*VLOOKUP(E13,Sayfa2!$A$1:$B$72,2,1)>160,(F13/100)*VLOOKUP(E13,Sayfa2!$A$1:$B$72,2,1),160),IF(N13=\"DOĞRU\",160,\"\")))","v":""},""]
[8,null,null,null,null,null,"","","YANLIŞ","YANLIŞ","YANLIŞ","YANLIŞ","YANLIŞ","YANLIŞ",{"$f":"IF(E14=\"\",\"\",IF(OR(AND(L14=\"DOĞRU\",F14>0),AND(M14=\"DOĞRU\",F14>0)),IF((F14/100)*VLOOKUP(E14,Sayfa2!$A$1:$B$72,2,1)>160,(F14/100)*VLOOKUP(E14,Sayfa2!$A$1:$B$72,2,1),160),IF(N14=\"DOĞRU\",160,\"\")))","v":""},""]
[9,null,null,null,null,null,"","","YANLIŞ","YANLIŞ","YANLIŞ","YANLIŞ","YANLIŞ","YANLIŞ",{"$f":"IF(E15=\"\",\"\",IF(OR(AND(L15=\"DOĞRU\",F15>0),AND(M15=\"DOĞRU\",F15>0)),IF((F15/100)*VLOOKUP(E15,Sayfa2!$A$1:$B$72,2,1)>160,(F15/100)*VLOOKUP(E15,Sayfa2!$A$1:$B$72,2,1),160),IF(N15=\"DOĞRU\",160,\"\")))","v":""},""]
[10,null,null,null,null,null,"","","YANLIŞ","YANLIŞ","YANLIŞ","YANLIŞ","YANLIŞ","YANLIŞ",{"$f":"IF(E16=\"\",\"\",IF(OR(AND(L16=\"DOĞRU\",F16>0),AND(M16=\"DOĞRU\",F16>0)),IF((F16/100)*VLOOKUP(E16,Sayfa2!$A$1:$B$72,2,1)>160,(F16/100)*VLOOKUP(E16,Sayfa2!$A$1:$B$72,2,1),160),IF(N16=\"DOĞRU\",160,\"\")))","v":""},""]
[11,null,null,null,null,null,"","","YANLIŞ","YANLIŞ","YANLIŞ","YANLIŞ","YANLIŞ","YANLIŞ",{"$f":"IF(E17=\"\",\"\",IF(OR(AND(L17=\"DOĞRU\",F17>0),AND(M17=\"DOĞRU\",F17>0)),IF((F17/100)*VLOOKUP(E17,Sayfa2!$A$1:$B$72,2,1)>160,(F17/100)*VLOOKUP(E17,Sayfa2!$A$1:$B$72,2,1),160),IF(N17=\"DOĞRU\",160,\"\")))","v":""},""]
[12,null,null,null,null,null,"","","YANLIŞ","YANLIŞ","YANLIŞ","YANLIŞ","YANLIŞ","YANLIŞ",{"$f":"IF(E18=\"\",\"\",IF(OR(AND(L18=\"DOĞRU\",F18>0),AND(M18=\"DOĞRU\",F18>0)),IF((F18/100)*VLOOKUP(E18,Sayfa2!$A$1:$B$72,2,1)>160,(F18/100)*VLOOKUP(E18,Sayfa2!$A$1:$B$72,2,1),160),IF(N18=\"DOĞRU\",160,\"\")))","v":""},""]
[13,null,null,null,null,null,"","","YANLIŞ","YANLIŞ","YANLIŞ","YANLIŞ","YANLIŞ","YANLIŞ",{"$f":"IF(E19=\"\",\"\",IF(OR(AND(L19=\"DOĞRU\",F19>0),AND(M19=\"DOĞRU\",F19>0)),IF((F19/100)*VLOOKUP(E19,Sayfa2!$A$1:$B$72,2,1)>160,(F19/100)*VLOOKUP(E19,Sayfa2!$A$1:$B$72,2,1),160),IF(N19=\"DOĞRU\",160,\"\")))","v":""},""]
[14,null,null,null,null,null,"","","YANLIŞ","YANLIŞ","YANLIŞ","YANLIŞ","YANLIŞ","YANLIŞ",{"$f":"IF(E20=\"\",\"\",IF(OR(AND(L20=\"DOĞRU\",F20>0),AND(M20=\"DOĞRU\",F20>0)),IF((F20/100)*VLOOKUP(E20,Sayfa2!$A$1:$B$72,2,1)>160,(F20/100)*VLOOKUP(E20,Sayfa2!$A$1:$B$72,2,1),160),IF(N20=\"DOĞRU\",160,\"\")))","v":""},""]
[15,null,null,null,null,null,"","","YANLIŞ","YANLIŞ","YANLIŞ","YANLIŞ","YANLIŞ","YANLIŞ",{"$f":"IF(E21=\"\",\"\",IF(OR(AND(L21=\"DOĞRU\",F21>0),AND(M21=\"DOĞRU\",F21>0)),IF((F21/100)*VLOOKUP(E21,Sayfa2!$A$1:$B$72,2,1)>160,(F21/100)*VLOOKUP(E21,Sayfa2!$A$1:$B$72,2,1),160),IF(N21=\"DOĞRU\",160,\"\")))","v":""},""]
[16,null,null,null,null,null,"","","YANLIŞ","YANLIŞ","YANLIŞ","YANLIŞ","YANLIŞ","YANLIŞ",{"$f":"IF(E22=\"\",\"\",IF(OR(AND(L22=\"DOĞRU\",F22>0),AND(M22=\"DOĞRU\",F22>0)),IF((F22/100)*VLOOKUP(E22,Sayfa2!$A$1:$B$72,2,1)>160,(F22/100)*VLOOKUP(E22,Sayfa2!$A$1:$B$72,2,1),160),IF(N22=\"DOĞRU\",160,\"\")))","v":""},""]
[17,null,null,null,null,null,"","","YANLIŞ","YANLIŞ","YANLIŞ","YANLIŞ","YANLIŞ","YANLIŞ",{"$f":"IF(E23=\"\",\"\",IF(OR(AND(L23=\"DOĞRU\",F23>0),AND(M23=\"DOĞRU\",F23>0)),IF((F23/100)*VLOOKUP(E23,Sayfa2!$A$1:$B$72,2,1)>160,(F23/100)*VLOOKUP(E23,Sayfa2!$A$1:$B$72,2,1),160),IF(N23=\"DOĞRU\",160,\"\")))","v":""},""]
[18,null,null,null,null,null,"","","YANLIŞ","YANLIŞ","YANLIŞ","YANLIŞ","YANLIŞ","YANLIŞ",{"$f":"IF(E24=\"\",\"\",IF(OR(AND(L24=\"DOĞRU\",F24>0),AND(M24=\"DOĞRU\",F24>0)),IF((F24/100)*VLOOKUP(E24,Sayfa2!$A$1:$B$72,2,1)>160,(F24/100)*VLOOKUP(E24,Sayfa2!$A$1:$B$72,2,1),160),IF(N24=\"DOĞRU\",160,\"\")))","v":""},""]
[19,null,null,null,null,null,"","","YANLIŞ","YANLIŞ","YANLIŞ","YANLIŞ","YANLIŞ","YANLIŞ",{"$f":"IF(E25=\"\",\"\",IF(OR(AND(L25=\"DOĞRU\",F25>0),AND(M25=\"DOĞRU\",F25>0)),IF((F25/100)*VLOOKUP(E25,Sayfa2!$A$1:$B$72,2,1)>160,(F25/100)*VLOOKUP(E25,Sayfa2!$A$1:$B$72,2,1),160),IF(N25=\"DOĞRU\",160,\"\")))","v":""},""]
[20,null,null,null,null,null,"","","YANLIŞ","YANLIŞ","YANLIŞ","YANLIŞ","YANLIŞ","YANLIŞ",{"$f":"IF(E26=\"\",\"\",IF(OR(AND(L26=\"DOĞRU\",F26>0),AND(M26=\"DOĞRU\",F26>0)),IF((F26/100)*VLOOKUP(E26,Sayfa2!$A$1:$B$72,2,1)>160,(F26/100)*VLOOKUP(E26,Sayfa2!$A$1:$B$72,2,1),160),IF(N26=\"DOĞRU\",160,\"\")))","v":""},""]
[21,null,null,null,null,null,"","","YANLIŞ","YANLIŞ","YANLIŞ","YANLIŞ","YANLIŞ","YANLIŞ",{"$f":"IF(E27=\"\",\"\",IF(OR(AND(L27=\"DOĞRU\",F27>0),AND(M27=\"DOĞRU\",F27>0)),IF((F27/100)*VLOOKUP(E27,Sayfa2!$A$1:$B$72,2,1)>160,(F27/100)*VLOOKUP(E27,Sayfa2!$A$1:$B$72,2,1),160),IF(N27=\"DOĞRU\",160,\"\")))","v":""},""]
[22,null,null,null,null,null,"","","YANLIŞ","YANLIŞ","YANLIŞ","YANLIŞ","YANLIŞ","YANLIŞ",{"$f":"IF(E28=\"\",\"\",IF(OR(AND(L28=\"DOĞRU\",F28>0),AND(M28=\"DOĞRU\",F28>0)),IF((F28/100)*VLOOKUP(E28,Sayfa2!$A$1:$B$72,2,1)>160,(F28/100)*VLOOKUP(E28,Sayfa2!$A$1:$B$72,2,1),160),IF(N28=\"DOĞRU\",160,\"\")))","v":""},""]
[23,null,null,null,null,null,"","","YANLIŞ","YANLIŞ","YANLIŞ","YANLIŞ","YANLIŞ","YANLIŞ",{"$f":"IF(E29=\"\",\"\",IF(OR(AND(L29=\"DOĞRU\",F29>0),AND(M29=\"DOĞRU\",F29>0)),IF((F29/100)*VLOOKUP(E29,Sayfa2!$A$1:$B$72,2,1)>160,(F29/100)*VLOOKUP(E29,Sayfa2!$A$1:$B$72,2,1),160),IF(N29=\"DOĞRU\",160,\"\")))","v":""},""]
[24,null,null,null,null,null,"","","YANLIŞ","YANLIŞ","YANLIŞ","YANLIŞ","YANLIŞ","YANLIŞ",{"$f":"IF(E30=\"\",\"\",IF(OR(AND(L30=\"DOĞRU\",F30>0),AND(M30=\"DOĞRU\",F30>0)),IF((F30/100)*VLOOKUP(E30,Sayfa2!$A$1:$B$72,2,1)>160,(F30/100)*VLOOKUP(E30,Sayfa2!$A$1:$B$72,2,1),160),IF(N30=\"DOĞRU\",160,\"\")))","v":""},""]
[25,null,null,null,null,null,"","","YANLIŞ","YANLIŞ","YANLIŞ","YANLIŞ","YANLIŞ","YANLIŞ",{"$f":"IF(E31=\"\",\"\",IF(OR(AND(L31=\"DOĞRU\",F31>0),AND(M31=\"DOĞRU\",F31>0)),IF((F31/100)*VLOOKUP(E31,Sayfa2!$A$1:$B$72,2,1)>160,(F31/100)*VLOOKUP(E31,Sayfa2!$A$1:$B$72,2,1),160),IF(N31=\"DOĞRU\",160,\"\")))","v":""},""]
[26,null,null,null,null,null,"","","YANLIŞ","YANLIŞ","YANLIŞ","YANLIŞ","YANLIŞ","YANLIŞ",{"$f":"IF(E32=\"\",\"\",IF(OR(AND(L32=\"DOĞRU\",F32>0),AND(M32=\"DOĞRU\",F32>0)),IF((F32/100)*VLOOKUP(E32,Sayfa2!$A$1:$B$72,2,1)>160,(F32/100)*VLOOKUP(E32,Sayfa2!$A$1:$B$72,2,1),160),IF(N32=\"DOĞRU\",160,\"\")))","v":""},""]
[27,null,null,null,null,null,"","","YANLIŞ","YANLIŞ","YANLIŞ","YANLIŞ","YANLIŞ","YANLIŞ",{"$f":"IF(E33=\"\",\"\",IF(OR(AND(L33=\"DOĞRU\",F33>0),AND(M33=\"DOĞRU\",F33>0)),IF((F33/100)*VLOOKUP(E33,Sayfa2!$A$1:$B$72,2,1)>160,(F33/100)*VLOOKUP(E33,Sayfa2!$A$1:$B$72,2,1),160),IF(N33=\"DOĞRU\",160,\"\")))","v":""},""]
[28,null,null,null,null,null,"","","YANLIŞ","YANLIŞ","YANLIŞ","YANLIŞ","YANLIŞ","YANLIŞ",{"$f":"IF(E34=\"\",\"\",IF(OR(AND(L34=\"DOĞRU\",F34>0),AND(M34=\"DOĞRU\",F34>0)),IF((F34/100)*VLOOKUP(E34,Sayfa2!$A$1:$B$72,2,1)>160,(F34/100)*VLOOKUP(E34,Sayfa2!$A$1:$B$72,2,1),160),IF(N34=\"DOĞRU\",160,\"\")))","v":""},""]
[29,null,null,null,null,null,"","","YANLIŞ","YANLIŞ","YANLIŞ","YANLIŞ","YANLIŞ","YANLIŞ",{"$f":"IF(E35=\"\",\"\",IF(OR(AND(L35=\"DOĞRU\",F35>0),AND(M35=\"DOĞRU\",F35>0)),IF((F35/100)*VLOOKUP(E35,Sayfa2!$A$1:$B$72,2,1)>160,(F35/100)*VLOOKUP(E35,Sayfa2!$A$1:$B$72,2,1),160),IF(N35=\"DOĞRU\",160,\"\")))","v":""},""]
[30,null,null,null,null,null,"","","YANLIŞ","YANLIŞ","YANLIŞ","YANLIŞ","YANLIŞ","YANLIŞ",{"$f":"IF(E36=\"\",\"\",IF(OR(AND(L36=\"DOĞRU\",F36>0),AND(M36=\"DOĞRU\",F36>0)),IF((F36/100)*VLOOKUP(E36,Sayfa2!$A$1:$B$72,2,1)>160,(F36/100)*VLOOKUP(E36,Sayfa2!$A$1:$B$72,2,1),160),IF(N36=\"DOĞRU\",160,\"\")))","v":""},""]
[31,null,null,null,null,null,"","","YANLIŞ","YANLIŞ","YANLIŞ","YANLIŞ","YANLIŞ","YANLIŞ",{"$f":"IF(E37=\"\",\"\",IF(OR(AND(L37=\"DOĞRU\",F37>0),AND(M37=\"DOĞRU\",F37>0)),IF((F37/100)*VLOOKUP(E37,Sayfa2!$A$1:$B$72,2,1)>160,(F37/100)*VLOOKUP(E37,Sayfa2!$A$1:$B$72,2,1),160),IF(N37=\"DOĞRU\",160,\"\")))","v":""},""]
[32,null,null,null,null,null,"","","YANLIŞ","YANLIŞ","YANLIŞ","YANLIŞ","YANLIŞ","YANLIŞ",{"$f":"IF(E38=\"\",\"\",IF(OR(AND(L38=\"DOĞRU\",F38>0),AND(M38=\"DOĞRU\",F38>0)),IF((F38/100)*VLOOKUP(E38,Sayfa2!$A$1:$B$72,2,1)>160,(F38/100)*VLOOKUP(E38,Sayfa2!$A$1:$B$72,2,1),160),IF(N38=\"DOĞRU\",160,\"\")))","v":""},""]
[33,null,null,null,null,null,"","","YANLIŞ","YANLIŞ","YANLIŞ","YANLIŞ","YANLIŞ","YANLIŞ",{"$f":"IF(E39=\"\",\"\",IF(OR(AND(L39=\"DOĞRU\",F39>0),AND(M39=\"DOĞRU\",F39>0)),IF((F39/100)*VLOOKUP(E39,Sayfa2!$A$1:$B$72,2,1)>160,(F39/100)*VLOOKUP(E39,Sayfa2!$A$1:$B$72,2,1),160),IF(N39=\"DOĞRU\",160,\"\")))","v":""},""]
[34,null,null,null,null,null,"","","YANLIŞ","YANLIŞ","YANLIŞ","YANLIŞ","YANLIŞ","YANLIŞ",{"$f":"IF(E40=\"\",\"\",IF(OR(AND(L40=\"DOĞRU\",F40>0),AND(M40=\"DOĞRU\",F40>0)),IF((F40/100)*VLOOKUP(E40,Sayfa2!$A$1:$B$72,2,1)>160,(F40/100)*VLOOKUP(E40,Sayfa2!$A$1:$B$72,2,1),160),IF(N40=\"DOĞRU\",160,\"\")))","v":""},""]
[35,null,null,null,null,null,"","","YANLIŞ","YANLIŞ","YANLIŞ","YANLIŞ","YANLIŞ","YANLIŞ",{"$f":"IF(E41=\"\",\"\",IF(OR(AND(L41=\"DOĞRU\",F41>0),AND(M41=\"DOĞRU\",F41>0)),IF((F41/100)*VLOOKUP(E41,Sayfa2!$A$1:$B$72,2,1)>160,(F41/100)*VLOOKUP(E41,Sayfa2!$A$1:$B$72,2,1),160),IF(N41=\"DOĞRU\",160,\"\")))","v":""},""]
[36,null,null,null,null,null,"","","YANLIŞ","YANLIŞ","YANLIŞ","YANLIŞ","YANLIŞ","YANLIŞ",{"$f":"IF(E42=\"\",\"\",IF(OR(AND(L42=\"DOĞRU\",F42>0),AND(M42=\"DOĞRU\",F42>0)),IF((F42/100)*VLOOKUP(E42,Sayfa2!$A$1:$B$72,2,1)>160,(F42/100)*VLOOKUP(E42,Sayfa2!$A$1:$B$72,2,1),160),IF(N42=\"DOĞRU\",160,\"\")))","v":""},""]
[37,null,null,null,null,null,"","","YANLIŞ","YANLIŞ","YANLIŞ","YANLIŞ","YANLIŞ","YANLIŞ",{"$f":"IF(E43=\"\",\"\",IF(OR(AND(L43=\"DOĞRU\",F43>0),AND(M43=\"DOĞRU\",F43>0)),IF((F43/100)*VLOOKUP(E43,Sayfa2!$A$1:$B$72,2,1)>160,(F43/100)*VLOOKUP(E43,Sayfa2!$A$1:$B$72,2,1),160),IF(N43=\"DOĞRU\",160,\"\")))","v":""},""]
[38,null,null,null,null,null,"","","YANLIŞ","YANLIŞ","YANLIŞ","YANLIŞ","YANLIŞ","YANLIŞ",{"$f":"IF(E44=\"\",\"\",IF(OR(AND(L44=\"DOĞRU\",F44>0),AND(M44=\"DOĞRU\",F44>0)),IF((F44/100)*VLOOKUP(E44,Sayfa2!$A$1:$B$72,2,1)>160,(F44/100)*VLOOKUP(E44,Sayfa2!$A$1:$B$72,2,1),160),IF(N44=\"DOĞRU\",160,\"\")))","v":""},""]
[39,null,null,null,null,null,"","","YANLIŞ","YANLIŞ","YANLIŞ","YANLIŞ","YANLIŞ","YANLIŞ",{"$f":"IF(E45=\"\",\"\",IF(OR(AND(L45=\"DOĞRU\",F45>0),AND(M45=\"DOĞRU\",F45>0)),IF((F45/100)*VLOOKUP(E45,Sayfa2!$A$1:$B$72,2,1)>160,(F45/100)*VLOOKUP(E45,Sayfa2!$A$1:$B$72,2,1),160),IF(N45=\"DOĞRU\",160,\"\")))","v":""},""]
[40,null,null,null,null,null,"","","YANLIŞ","YANLIŞ","YANLIŞ","YANLIŞ","YANLIŞ","YANLIŞ",{"$f":"IF(E46=\"\",\"\",IF(OR(AND(L46=\"DOĞRU\",F46>0),AND(M46=\"DOĞRU\",F46>0)),IF((F46/100)*VLOOKUP(E46,Sayfa2!$A$1:$B$72,2,1)>160,(F46/100)*VLOOKUP(E46,Sayfa2!$A$1:$B$72,2,1),160),IF(N46=\"DOĞRU\",160,\"\")))","v":""},""]
[41,null,null,null,null,null,"","","YANLIŞ","YANLIŞ","YANLIŞ","YANLIŞ","YANLIŞ","YANLIŞ",{"$f":"IF(E47=\"\",\"\",IF(OR(AND(L47=\"DOĞRU\",F47>0),AND(M47=\"DOĞRU\",F47>0)),IF((F47/100)*VLOOKUP(E47,Sayfa2!$A$1:$B$72,2,1)>160,(F47/100)*VLOOKUP(E47,Sayfa2!$A$1:$B$72,2,1),160),IF(N47=\"DOĞRU\",160,\"\")))","v":""},""]
[42,null,null,null,null,null,"","","YANLIŞ","YANLIŞ","YANLIŞ","YANLIŞ","YANLIŞ","YANLIŞ",{"$f":"IF(E48=\"\",\"\",IF(OR(AND(L48=\"DOĞRU\",F48>0),AND(M48=\"DOĞRU\",F48>0)),IF((F48/100)*VLOOKUP(E48,Sayfa2!$A$1:$B$72,2,1)>160,(F48/100)*VLOOKUP(E48,Sayfa2!$A$1:$B$72,2,1),160),IF(N48=\"DOĞRU\",160,\"\")))","v":""},""]
[43,null,null,null,null,null,"","","YANLIŞ","YANLIŞ","YANLIŞ","YANLIŞ","YANLIŞ","YANLIŞ",{"$f":"IF(E49=\"\",\"\",IF(OR(AND(L49=\"DOĞRU\",F49>0),AND(M49=\"DOĞRU\",F49>0)),IF((F49/100)*VLOOKUP(E49,Sayfa2!$A$1:$B$72,2,1)>160,(F49/100)*VLOOKUP(E49,Sayfa2!$A$1:$B$72,2,1),160),IF(N49=\"DOĞRU\",160,\"\")))","v":""},""]
[44,null,null,null,null,null,"","","YANLIŞ","YANLIŞ","YANLIŞ","YANLIŞ","YANLIŞ","YANLIŞ",{"$f":"IF(E50=\"\",\"\",IF(OR(AND(L50=\"DOĞRU\",F50>0),AND(M50=\"DOĞRU\",F50>0)),IF((F50/100)*VLOOKUP(E50,Sayfa2!$A$1:$B$72,2,1)>160,(F50/100)*VLOOKUP(E50,Sayfa2!$A$1:$B$72,2,1),160),IF(N50=\"DOĞRU\",160,\"\")))","v":""},""]
[45,null,null,null,null,null,"","","YANLIŞ","YANLIŞ","YANLIŞ","YANLIŞ","YANLIŞ","YANLIŞ",{"$f":"IF(E51=\"\",\"\",IF(OR(AND(L51=\"DOĞRU\",F51>0),AND(M51=\"DOĞRU\",F51>0)),IF((F51/100)*VLOOKUP(E51,Sayfa2!$A$1:$B$72,2,1)>160,(F51/100)*VLOOKUP(E51,Sayfa2!$A$1:$B$72,2,1),160),IF(N51=\"DOĞRU\",160,\"\")))","v":""},""]
[46,null,null,null,null,null,"","","YANLIŞ","YANLIŞ","YANLIŞ","YANLIŞ","YANLIŞ","YANLIŞ",{"$f":"IF(E52=\"\",\"\",IF(OR(AND(L52=\"DOĞRU\",F52>0),AND(M52=\"DOĞRU\",F52>0)),IF((F52/100)*VLOOKUP(E52,Sayfa2!$A$1:$B$72,2,1)>160,(F52/100)*VLOOKUP(E52,Sayfa2!$A$1:$B$72,2,1),160),IF(N52=\"DOĞRU\",160,\"\")))","v":""},""]
[47,null,null,null,null,null,"","","YANLIŞ","YANLIŞ","YANLIŞ","YANLIŞ","YANLIŞ","YANLIŞ",{"$f":"IF(E53=\"\",\"\",IF(OR(AND(L53=\"DOĞRU\",F53>0),AND(M53=\"DOĞRU\",F53>0)),IF((F53/100)*VLOOKUP(E53,Sayfa2!$A$1:$B$72,2,1)>160,(F53/100)*VLOOKUP(E53,Sayfa2!$A$1:$B$72,2,1),160),IF(N53=\"DOĞRU\",160,\"\")))","v":""},""]
[48,null,null,null,null,null,"","","YANLIŞ","YANLIŞ","YANLIŞ","YANLIŞ","YANLIŞ","YANLIŞ",{"$f":"IF(E54=\"\",\"\",IF(OR(AND(L54=\"DOĞRU\",F54>0),AND(M54=\"DOĞRU\",F54>0)),IF((F54/100)*VLOOKUP(E54,Sayfa2!$A$1:$B$72,2,1)>160,(F54/100)*VLOOKUP(E54,Sayfa2!$A$1:$B$72,2,1),160),IF(N54=\"DOĞRU\",160,\"\")))","v":""},""]
[49,null,null,null,null,null,"","","YANLIŞ","YANLIŞ","YANLIŞ","YANLIŞ","YANLIŞ","YANLIŞ",{"$f":"IF(E55=\"\",\"\",IF(OR(AND(L55=\"DOĞRU\",F55>0),AND(M55=\"DOĞRU\",F55>0)),IF((F55/100)*VLOOKUP(E55,Sayfa2!$A$1:$B$72,2,1)>160,(F55/100)*VLOOKUP(E55,Sayfa2!$A$1:$B$72,2,1),160),IF(N55=\"DOĞRU\",160,\"\")))","v":""},""]
[50,null,null,null,null,null,"","","YANLIŞ","YANLIŞ","YANLIŞ","YANLIŞ","YANLIŞ","YANLIŞ",{"$f":"IF(E56=\"\",\"\",IF(OR(AND(L56=\"DOĞRU\",F56>0),AND(M56=\"DOĞRU\",F56>0)),IF((F56/100)*VLOOKUP(E56,Sayfa2!$A$1:$B$72,2,1)>160,(F56/100)*VLOOKUP(E56,Sayfa2!$A$1:$B$72,2,1),160),IF(N56=\"DOĞRU\",160,\"\")))","v":""},""]
[51,null,null,null,null,null,"","","YANLIŞ","YANLIŞ","YANLIŞ","YANLIŞ","YANLIŞ","YANLIŞ",{"$f":"IF(E57=\"\",\"\",IF(OR(AND(L57=\"DOĞRU\",F57>0),AND(M57=\"DOĞRU\",F57>0)),IF((F57/100)*VLOOKUP(E57,Sayfa2!$A$1:$B$72,2,1)>160,(F57/100)*VLOOKUP(E57,Sayfa2!$A$1:$B$72,2,1),160),IF(N57=\"DOĞRU\",160,\"\")))","v":""},""]
[52,null,null,null,null,null,"","","YANLIŞ","YANLIŞ","YANLIŞ","YANLIŞ","YANLIŞ","YANLIŞ",{"$f":"IF(E58=\"\",\"\",IF(OR(AND(L58=\"DOĞRU\",F58>0),AND(M58=\"DOĞRU\",F58>0)),IF((F58/100)*VLOOKUP(E58,Sayfa2!$A$1:$B$72,2,1)>160,(F58/100)*VLOOKUP(E58,Sayfa2!$A$1:$B$72,2,1),160),IF(N58=\"DOĞRU\",160,\"\")))","v":""},""]
[53,null,null,null,null,null,"","","YANLIŞ","YANLIŞ","YANLIŞ","YANLIŞ","YANLIŞ","YANLIŞ",{"$f":"IF(E59=\"\",\"\",IF(OR(AND(L59=\"DOĞRU\",F59>0),AND(M59=\"DOĞRU\",F59>0)),IF((F59/100)*VLOOKUP(E59,Sayfa2!$A$1:$B$72,2,1)>160,(F59/100)*VLOOKUP(E59,Sayfa2!$A$1:$B$72,2,1),160),IF(N59=\"DOĞRU\",160,\"\")))","v":""},""]
[54,null,null,null,null,null,"","","YANLIŞ","YANLIŞ","YANLIŞ","YANLIŞ","YANLIŞ","YANLIŞ",{"$f":"IF(E60=\"\",\"\",IF(OR(AND(L60=\"DOĞRU\",F60>0),AND(M60=\"DOĞRU\",F60>0)),IF((F60/100)*VLOOKUP(E60,Sayfa2!$A$1:$B$72,2,1)>160,(F60/100)*VLOOKUP(E60,Sayfa2!$A$1:$B$72,2,1),160),IF(N60=\"DOĞRU\",160,\"\")))","v":""},""]
{"$rows_left_out":197}
{"sheet":"Sayfa2","index":1,"n_rows":48,"n_cols":2,"rows_kept":48,"cut":false,"hidden":true,"merged":[]}
["Tür","Analiz Katsayı "]
["Acur",6.8159999999999998]
["Adi Fiğ",0.96599999999999997]
["Arpa",0.156]
["Ayçiçeği",1.446]
["Bakla ",0.96599999999999997]
["Bamya",6.8159999999999998]
["Bezelye",0.96599999999999997]
["Biber",6.8159999999999998]
["Brokoli",6.8159999999999998]
["Domates",6.8159999999999998]
["Ekmeklik Buğday",0.156]
["Fasulye",0.14799999999999999]
["Fiğ",0.96599999999999997]
["Hıyar",6.8159999999999998]
["Ispanak",1.6459999999999999]
["Kabak",6.8159999999999998]
["Karnabahar",6.8159999999999998]
["Karpuz",6.8159999999999998]
["Kavun",6.8159999999999998]
["Kolza",0.96599999999999997]
["Lahana",6.8159999999999998]
["Makarnalık Buğday",0.156]
["Marul",6.8159999999999998]
["Maydanoz",6.8159999999999998]
["Mercimek",0.14799999999999999]
["Mısır",1.446]
["Nohut",0.14799999999999999]
["Pamuk",1.446]
["Patlıcan",6.8159999999999998]
["Roka",6.8159999999999998]
["Semizotu",6.8159999999999998]
["Soğan",6.8159999999999998]
["Soya",0.96599999999999997]
["Şeker Pancarı",1.446]
["Tere",6.8159999999999998]
["Tiritikale",0.156]
["Turp",6.8159999999999998]
["Yer Fıstığı",0.96599999999999997]
["Yonca",0.96599999999999997]
["Yulaf",0.156]
["Koca Fiğ",0.96599999999999997]
["Tüylü Fiğ",0.96599999999999997]
["Dereotu",6.8159999999999998]
["Çemen",0.96599999999999997]
["Havuç",6.8159999999999998]
["Pazı",6.8159999999999998]
["Kırmızı Pancar",6.8159999999999998]